*KEYWORD
*NODE
*ELEMENT_SHELL
*CONSTRAINED_EXTRA_NODES_NODE
*CONTACT_AUTOMATIC_SURFACE_TO_SURFACE_ID
30000001  *CONTACT_AUTOMATIC_SURFACE_TO_SURFACE
*PART
SECTION_SHELL
*SECTION_SHELL_TITLE
SECTION_SHELL
*MAT_RIGID_TITLE
Default MAT20 MAT_RIGID