*KEYWORD
*NODE
*CONSTRAINED_NODAL_RIGID_BODY
*ELEMENT_SEATBELT
*ELEMENT_SHELL
*ELEMENT_SEATBELT_PRETENSIONER
*ELEMENT_SEATBELT_RETRACTOR
*ELEMENT_SEATBELT_SENSOR
*ELEMENT_SEATBELT_SLIPRING
*CONSTRAINED_EXTRA_NODES_SET
*CONSTRAINED_RIGID_BODIES
*CONTACT_AUTOMATIC_SURFACE_TO_SURFACE_ID
70000001  Dummy_Floor_Contact
*CONTACT_AUTOMATIC_SURFACE_TO_SURFACE_ID
70000002  Dummy_SeatBelt
*CONTACT_AUTOMATIC_SURFACE_TO_SURFACE_ID
70000003  Dummy_Seat_Contact
*CONTACT_AUTOMATIC_SINGLE_SURFACE_ID
70000004  *CONTACT_AUTOMATIC_SINGLE_SURFACE
*PART
floor
*SECTION_SHELL_TITLE
floor
*PART
hm-bits
*SECTION_SHELL_TITLE
hm-bits
*PART
Steel_Connection_Seatbelt
*SECTION_SHELL_TITLE
Steel_Connection_Seatbelt
*PART
BARRIER_RIGID_PATCH
*SECTION_SHELL_TITLE
BARRIER_RIGID_PATCH
*PART
BARRIER_RIGID_PATCH
*SECTION_SHELL_TITLE
BARRIER_RIGID_PATCH
*PART_CONTACT
slip_ring_bracket_top_Rigid
*SECTION_SHELL_TITLE
slip_ring_bracket_top_Rigid
*PART
Offset_base_side_frame_left_Rigid
*SECTION_SHELL_TITLE
Offset_base_side_frame_left_Rigid
*PART_CONTACT
retractor_plate_Rigid
*SECTION_SHELL_TITLE
retractor_plate_Rigid
*PART
RIGID_PATCH_TOP
*SECTION_SHELL_TITLE
RIGID_PATCH_TOP
*PART
RIGID_PATCH_Retractor
*SECTION_SHELL_TITLE
RIGID_PATCH_Retractor
*PART
Seatbelt SECTION_SEATBELT
*SECTION_SEATBELT_TITLE
Seatbelt SECTION_SEATBELT
*PART
Seatbelt Shoulder SECTION_SHELL
*SECTION_SHELL_TITLE
Seatbelt Shoulder SECTION_SHELL
*PART
Seatbelt LAP SECTION_SHELL
*SECTION_SHELL_TITLE
Seatbelt LAP SECTION_SHELL
*LOAD_BODY_Z
*BOUNDARY_PRESCRIBED_MOTION_RIGID_ID
*MAT_RIGID_TITLE
MAT_RIGID STEEL
*MAT_SEATBELT_TITLE
SEATBELT_1D
*MAT_SEATBELT_TITLE
SEATBELT_2D
*MAT_RIGID_TITLE
RIGID_MAT_FLOOR
*MAT_RIGID_TITLE
MAT_RIGID STEEL
*DEFINE_CURVE_TITLE
Seatbelt_loading_curve
*DEFINE_CURVE_TITLE
Seatbelt_unloading_curve
*DEFINE_CURVE_TITLE
FeedVsForce(mmN)
*DEFINE_CURVE_TITLE
Seatbelt_load_limiter_unloading_zero
*DEFINE_CURVE_TITLE
ForceVsTime(N/sec)
*DEFINE_CURVE
*DEFINE_CURVE_TITLE
Plastic_Loadcurve
*DEFINE_CURVE_TITLE
Anonymous *DEFINE_CURVE
*DATABASE_CROSS_SECTION_PLANE_ID
  70000000Cross_Section_Right
*DATABASE_CROSS_SECTION_PLANE_ID
  70000001Cross_Section_Left
*DATABASE_CROSS_SECTION_SET_ID
  70000002DATABASE_CROSS_SECTION_SET
*DATABASE_CROSS_SECTION_SET_ID
  70000003DATABASE_CROSS_SECTION_SET
*DATABASE_CROSS_SECTION_SET_ID
  70000004DATABASE_CROSS_SECTION_SET
*DATABASE_CROSS_SECTION_SET_ID
  70000005DATABASE_CROSS_SECTION_SET
*DATABASE_CROSS_SECTION_PLANE_ID
  70000006CS_Back_Right
*DATABASE_CROSS_SECTION_PLANE_ID
  70000007CS_Back_Left
*SET_PART_LIST_TITLE
Dummy_Floor
*SET_PART_LIST_TITLE
Floor_Contact
*SET_PART_LIST_TITLE
SeatBelt
*SET_PART_LIST_TITLE
Seat_Contact
*SET_NODE_LIST_TITLE
SET_NODE_0070000011
*SET_NODE_LIST_TITLE
SET_NODE_0070000012
*SET_NODE_LIST_TITLE
SET_NODE_0070000013
*SET_NODE_LIST_TITLE
SET_NODE_0070000014
*SET_NODE_LIST_TITLE
SET_NODE_0070000015
*SET_NODE_LIST_TITLE
Lapbelt_Edgeset
*SET_NODE_LIST_TITLE
Shoulderblet_Set
*SET_NODE_LIST_TITLE
SET_NODE_0070000021
*SET_NODE_LIST_TITLE
SET_NODE_0070000022
*SET_NODE_LIST_TITLE
SET_NODE_0070000023
*SET_NODE_LIST_TITLE
SET_NODE_0070000024
*SET_NODE_LIST_TITLE
SET_NODE_0070000025
*SET_NODE_LIST_TITLE
SET_NODE_0070000026
*SET_NODE_LIST_TITLE
SET_NODE_0070000027
*SET_NODE_LIST_TITLE
SET_NODE_0070000028
*SET_NODE_LIST_TITLE
SET_NODE_0070000029
*SET_NODE_LIST_TITLE
SET_NODE_0070000030
*SET_NODE_LIST_TITLE
SET_NODE_0070000031
*SET_NODE_LIST_TITLE
SET_NODE_0070000032
*SET_NODE_LIST_TITLE
SET_NODE_0070000033
*SET_NODE_LIST_TITLE
SET_NODE_0070000034
*SET_NODE_LIST_TITLE
SET_NODE_0070000035
*SET_NODE_LIST_TITLE
SET_NODE_0070000036
*SET_NODE_LIST_TITLE
SET_NODE_0070000037
*SET_NODE_LIST_TITLE
SET_NODE_0070000038
*SET_NODE_LIST_TITLE
SET_NODE_0070000039
*SET_NODE_LIST_TITLE
SET_NODE_0070000040
*SET_NODE_LIST_TITLE
SET_NODE_0070000041
*SET_NODE_LIST_TITLE
SET_NODE_0070000042
*SET_NODE_LIST_TITLE
SET_NODE_0070000043
*SET_NODE_LIST_TITLE
SET_NODE_0070000044
*SET_NODE_LIST_TITLE
SET_NODE_0070000045
*SET_NODE_LIST_TITLE
SET_NODE_0070000046
*SET_NODE_LIST_TITLE
SET_NODE_0070000047
*SET_NODE_LIST_TITLE
SET_NODE_0070000048
*SET_NODE_LIST_TITLE
SET_NODE_0070000049
*SET_NODE_LIST_TITLE
SET_NODE_0070000050
*SET_NODE_LIST_TITLE
SET_NODE_0070000051
*SET_NODE_LIST_TITLE
SET_NODE_0070000052
*SET_NODE_LIST_TITLE
SET_NODE_0070000053
*SET_NODE_LIST_TITLE
SET_NODE_0070000054
*SET_NODE_LIST_TITLE
SET_NODE_0070000055
*SET_NODE_LIST_TITLE
SET_NODE_0070000056
*SET_NODE_LIST_TITLE
SET_NODE_0070000057
*SET_NODE_LIST_TITLE
SET_NODE_0070000058
*SET_NODE_LIST_TITLE
SET_NODE_0070000059
*SET_NODE_LIST_TITLE
SET_NODE_0070000060
*SET_NODE_LIST_TITLE
SET_NODE_0070000061
*SET_NODE_LIST_TITLE
SET_NODE_0070000062
*SET_NODE_LIST_TITLE
SET_NODE_0070000063
*SET_NODE_LIST_TITLE
SET_NODE_0070000064
*SET_NODE_LIST_TITLE
SET_NODE_0070000065
*SET_NODE_LIST_TITLE
SET_NODE_0070000066
*SET_NODE_LIST_TITLE
SET_NODE_0070000067
*SET_NODE_LIST_TITLE
SET_NODE_0070000068
*SET_NODE_LIST_TITLE
SET_NODE_0070000069
*SET_NODE_LIST_TITLE
SET_NODE_0070000070
*SET_NODE_LIST_TITLE
SET_NODE_0070000071
*SET_NODE_LIST_TITLE
SET_NODE_0070000072
*SET_NODE_LIST_TITLE
SET_NODE_0070000073
*SET_NODE_LIST_TITLE
SET_NODE_0070000074
*SET_NODE_LIST_TITLE
SET_NODE_0070000075
*SET_NODE_LIST_TITLE
SET_NODE_0070000076
*SET_NODE_LIST_TITLE
SET_NODE_0070000077
*SET_NODE_LIST_TITLE
SET_NODE_0070000078
*SET_NODE_LIST_TITLE
SET_NODE_0070000079
*SET_NODE_LIST_TITLE
SET_NODE_0070000080
*SET_NODE_LIST_TITLE
SET_NODE_0070000081
*SET_NODE_LIST_TITLE
SET_NODE_0070000082
*SET_NODE_LIST_TITLE
SET_NODE_0070000083
*SET_NODE_LIST_TITLE
SET_NODE_0070000084
*SET_NODE_LIST_TITLE
SET_NODE_0070000085
*SET_NODE_LIST_TITLE
SET_NODE_0070000086
*SET_NODE_LIST_TITLE
SET_NODE_0070000087
*SET_NODE_LIST_TITLE
SET_NODE_0070000088
*SET_NODE_LIST_TITLE
SET_NODE_0070000089
*SET_NODE_LIST_TITLE
SET_NODE_0070000090
*SET_NODE_LIST_TITLE
SET_NODE_0070000091
*SET_NODE_LIST_TITLE
SET_NODE_0070000092
*SET_NODE_LIST_TITLE
SET_NODE_0070000093
*SET_NODE_LIST_TITLE
SET_NODE_0070000094
*SET_NODE_LIST_TITLE
SET_NODE_0070000095
*SET_NODE_LIST_TITLE
SET_NODE_0070000096
*SET_NODE_LIST_TITLE
SET_NODE_0070000097
*SET_NODE_LIST_TITLE
SET_NODE_0070000098
*SET_NODE_LIST_TITLE
SET_NODE_0070000099
*SET_NODE_LIST_TITLE
SET_NODE_0070000100
*SET_NODE_LIST_TITLE
SET_NODE_0070000101
*SET_NODE_LIST_TITLE
SET_NODE_0070000102
*SET_NODE_LIST_TITLE
SET_NODE_0070000103
*SET_NODE_LIST_TITLE
SET_NODE_0070000104
*SET_NODE_LIST_TITLE
SET_NODE_0070000105
*SET_NODE_LIST_TITLE
SET_NODE_0070000106
*SET_NODE_LIST_TITLE
SET_NODE_0070000107
*SET_NODE_LIST_TITLE
SET_NODE_0070000108
*SET_NODE_LIST_TITLE
SET_NODE_0070000109
*SET_NODE_LIST_TITLE
SET_NODE_0070000110
*SET_NODE_LIST_TITLE
SET_NODE_0070000111
*SET_NODE_LIST_TITLE
SET_NODE_0070000112
*SET_PART_LIST_TITLE
contact_part_set
*SET_PART_LIST_TITLE
Default Seatbelt Entity Master Set
*SET_NODE_LIST_TITLE
Seatbelt_Anchorage
*SET_NODE_LIST_TITLE
ShoulderBelt_Force_Top
*SET_SHELL_LIST_TITLE
ShoulderbeltForce_Top
*SET_NODE_LIST_TITLE
ShoulderbeltForce_Bottom
*SET_SHELL_LIST_TITLE
ShoulderbeltForce_botton
*SET_NODE_LIST_TITLE
LapbeltForce_Buckle
*SET_SHELL_LIST_TITLE
LapbeltForceBuckle
*SET_NODE_LIST_TITLE
LapbeltForce_Anchor
*SET_SHELL_LIST_TITLE
LapbeltForceAnchor
*SET_NODE_LIST_TITLE
SET_NODE_0070000167
*SET_NODE_LIST_TITLE
SET_NODE_0070000168
*SET_PART_LIST_TITLE
Default Seatbelt Entity Master Set@_1
*SET_PART_LIST_TITLE
Default Seatbelt Entity Slave Set
*SET_PART_LIST_TITLE
Default Seatbelt Entity Master Set@_2
*SET_NODE_LIST
*SET_NODE_LIST
*SET_NODE_LIST
*SET_NODE_LIST