*KEYWORD
*NODE
*CONSTRAINED_NODAL_RIGID_BODY
*ELEMENT_SEATBELT
*ELEMENT_SHELL
*ELEMENT_SEATBELT_PRETENSIONER
*ELEMENT_SEATBELT_RETRACTOR
*ELEMENT_SEATBELT_SENSOR
*ELEMENT_SEATBELT_SLIPRING
*CONSTRAINED_EXTRA_NODES_SET
*CONSTRAINED_RIGID_BODIES
*CONTACT_AUTOMATIC_SURFACE_TO_SURFACE_ID
70000001  Dummy_Floor_Contact
*CONTACT_AUTOMATIC_SURFACE_TO_SURFACE_ID
70000002  Dummy_SeatBelt
*CONTACT_AUTOMATIC_SURFACE_TO_SURFACE_ID
70000003  Dummy_Seat_Contact
*CONTACT_AUTOMATIC_SINGLE_SURFACE_ID
70000004  *CONTACT_AUTOMATIC_SINGLE_SURFACE
*PART
floor
*SECTION_SHELL_TITLE
floor
*PART
hm-bits
*SECTION_SHELL_TITLE
hm-bits
*PART
Steel_Connection_Seatbelt
*SECTION_SHELL_TITLE
Steel_Connection_Seatbelt
*PART
BARRIER_RIGID_PATCH
*SECTION_SHELL_TITLE
BARRIER_RIGID_PATCH
*PART
BARRIER_RIGID_PATCH
*SECTION_SHELL_TITLE
BARRIER_RIGID_PATCH
*PART_CONTACT
slip_ring_bracket_top_Rigid
*SECTION_SHELL_TITLE
slip_ring_bracket_top_Rigid
*PART
Offset_base_side_frame_left_Rigid
*SECTION_SHELL_TITLE
Offset_base_side_frame_left_Rigid
*PART_CONTACT
retractor_plate_Rigid
*SECTION_SHELL_TITLE
retractor_plate_Rigid
*PART
RIGID_PATCH_TOP
*SECTION_SHELL_TITLE
RIGID_PATCH_TOP
*PART
RIGID_PATCH_Retractor
*SECTION_SHELL_TITLE
RIGID_PATCH_Retractor
*PART
Seatbelt SECTION_SEATBELT
*SECTION_SEATBELT_TITLE
Seatbelt SECTION_SEATBELT
*PART
Seatbelt Shoulder SECTION_SHELL
*SECTION_SHELL_TITLE
Seatbelt Shoulder SECTION_SHELL
*PART
Seatbelt Lap SECTION_SHELL
*SECTION_SHELL_TITLE
Seatbelt Lap SECTION_SHELL
*LOAD_BODY_Z
*BOUNDARY_PRESCRIBED_MOTION_RIGID_ID
*MAT_RIGID_TITLE
MAT_RIGID STEEL
*MAT_SEATBELT_TITLE
SEATBELT_1D
*MAT_SEATBELT_TITLE
SEATBELT_2D
*MAT_RIGID_TITLE
RIGID_MAT_FLOOR
*MAT_RIGID_TITLE
MAT_RIGID STEEL
*MAT_ELASTIC_TITLE
Default MAT1 Material
*DEFINE_CURVE_TITLE
Seatbelt_loading_curve
*DEFINE_CURVE_TITLE
Seatbelt_unloading_curve
*DEFINE_CURVE_TITLE
Seatbelt_load_limiter_loading
*DEFINE_CURVE_TITLE
Seatbelt_load_limiter_unloading_zero
*DEFINE_CURVE_TITLE
Retractor_Force_loading_over_time_PEAK
*DEFINE_CURVE
*DEFINE_CURVE_TITLE
Plastic_Loadcurve
*DEFINE_CURVE_TITLE
Anonymous *DEFINE_CURVE
*DATABASE_CROSS_SECTION_PLANE_ID
  70000007Front_Left_Anchor
*DATABASE_CROSS_SECTION_PLANE_ID
  70000008Front_Right_Anchor
*DATABASE_CROSS_SECTION_PLANE_ID
  70000009Rear_Left_Anchor
*DATABASE_CROSS_SECTION_PLANE_ID
  70000010Rear_Right_Anchor
*SET_PART_LIST_TITLE
Dummy_Floor
*SET_PART_LIST_TITLE
Floor_Contact
*SET_PART_LIST_TITLE
SeatBelt
*SET_PART_LIST_TITLE
Seat_Contact
*SET_NODE_LIST
*SET_NODE_LIST
*SET_NODE_LIST
*SET_NODE_LIST
*SET_NODE_LIST
*SET_NODE_LIST_TITLE
Lapbelt_Edgeset
*SET_NODE_LIST_TITLE
Shoulderblet_Set
*SET_NODE_LIST
*SET_NODE_LIST
*SET_NODE_LIST
*SET_NODE_LIST
*SET_NODE_LIST
*SET_NODE_LIST
*SET_NODE_LIST
*SET_NODE_LIST
*SET_NODE_LIST
*SET_NODE_LIST
*SET_NODE_LIST
*SET_NODE_LIST
*SET_NODE_LIST
*SET_NODE_LIST
*SET_NODE_LIST
*SET_NODE_LIST
*SET_NODE_LIST
*SET_NODE_LIST
*SET_NODE_LIST
*SET_NODE_LIST
*SET_NODE_LIST
*SET_NODE_LIST
*SET_NODE_LIST
*SET_NODE_LIST
*SET_NODE_LIST
*SET_NODE_LIST
*SET_NODE_LIST
*SET_NODE_LIST
*SET_NODE_LIST
*SET_NODE_LIST
*SET_NODE_LIST
*SET_NODE_LIST
*SET_NODE_LIST
*SET_NODE_LIST
*SET_NODE_LIST
*SET_NODE_LIST
*SET_NODE_LIST
*SET_NODE_LIST
*SET_NODE_LIST
*SET_NODE_LIST
*SET_NODE_LIST
*SET_NODE_LIST
*SET_NODE_LIST
*SET_NODE_LIST
*SET_NODE_LIST
*SET_NODE_LIST
*SET_NODE_LIST
*SET_NODE_LIST
*SET_NODE_LIST
*SET_NODE_LIST
*SET_NODE_LIST
*SET_NODE_LIST
*SET_NODE_LIST
*SET_NODE_LIST
*SET_NODE_LIST
*SET_NODE_LIST
*SET_NODE_LIST
*SET_NODE_LIST
*SET_NODE_LIST
*SET_NODE_LIST
*SET_NODE_LIST
*SET_NODE_LIST
*SET_NODE_LIST
*SET_NODE_LIST
*SET_NODE_LIST
*SET_NODE_LIST
*SET_NODE_LIST
*SET_NODE_LIST
*SET_NODE_LIST
*SET_NODE_LIST
*SET_NODE_LIST
*SET_NODE_LIST
*SET_NODE_LIST
*SET_NODE_LIST
*SET_NODE_LIST
*SET_NODE_LIST
*SET_NODE_LIST
*SET_NODE_LIST
*SET_NODE_LIST
*SET_NODE_LIST
*SET_NODE_LIST
*SET_NODE_LIST
*SET_NODE_LIST
*SET_NODE_LIST
*SET_NODE_LIST
*SET_NODE_LIST
*SET_NODE_LIST
*SET_NODE_LIST
*SET_NODE_LIST
*SET_NODE_LIST
*SET_NODE_LIST
*SET_NODE_LIST
*SET_PART_LIST_TITLE
contact_part_set
*SET_PART_LIST_TITLE
Default Seatbelt Entity Master Set
*SET_NODE_LIST_TITLE
Seatbelt_Anchorage
*SET_NODE_LIST_TITLE
Buckle_Slipring
*SET_NODE_LIST
*SET_NODE_LIST
*SET_NODE_LIST_TITLE
CONSTRAINED_NODAL_RIGID_BODY_72000260_SET
*SET_PART_LIST_TITLE
Headrest_Set
*SET_PART_LIST_TITLE
Cross Section
*SET_SOLID_TITLE
Cross Section@_1
*SET_PART_LIST_TITLE
Cross Section@_2
*SET_PART_LIST_TITLE
Cross Section@_3
*SET_PART_LIST_TITLE
Cross Section@_4
*SET_PART_LIST_TITLE
Cross Section@_5
*SET_PART_LIST_TITLE
Cross Section@_6
*SET_PART_LIST_TITLE
Default Seatbelt Entity Master Set@_1
*SET_NODE_LIST
*SET_NODE_LIST
*SET_NODE_LIST
*SET_NODE_LIST