*KEYWORD
*NODE
*CONSTRAINED_NODAL_RIGID_BODY
*ELEMENT_SHELL
*ELEMENT_SOLID
*CONTACT_AUTOMATIC_NODES_TO_SURFACE_ID
50000004  *CONTACT_AUTOMATIC_NODES_TO_SURFACE
*PART
Base_Cushion_Skin
*SECTION_SHELL_TITLE
Base_Cushion_Skin
*PART
Base_Cushion_Solid
*SECTION_SOLID_TITLE
Base_Cushion_Solid
*PART
SECTION_SHELL
*SECTION_SHELL_TITLE
SECTION_SHELL
*PART
Back_Cushion_Skin
*SECTION_SHELL_TITLE
Back_Cushion_Skin
*PART
PSHELL
*SECTION_SHELL_TITLE
PSHELL
*PART
HEAD_REST
*SECTION_SHELL_TITLE
HEAD_REST
*PART
HEAD_REST_SOLID
*SECTION_SOLID_TITLE
HEAD_REST_SOLID
*PART
Back_Cushion_Solid
*SECTION_SOLID_TITLE
Back_Cushion_Solid
*MAT_ELASTIC_TITLE
Default MAT1 MAT_ELASTIC
*MAT_ELASTIC_TITLE
Default MAT1 Material
*SET_NODE_LIST_TITLE
Seat_Base_Constraint
*SET_NODE_LIST_TITLE
Back_cushion_Contact
*SET_NODE_LIST_TITLE
Base_Cushion_Contact
*SET_NODE_LIST_TITLE
Head_Rest_Rod_Upper
*SET_NODE_LIST_TITLE
Head_Rest_Rod_Lower
*SET_NODE_LIST
*SET_NODE_LIST
*SET_NODE_LIST
*SET_NODE_LIST
*SET_NODE_LIST
*SET_NODE_LIST
*SET_PART_LIST_TITLE
Seat_BackFoam
*SET_PART_LIST_TITLE
SeatBack_Foam
*SET_PART_LIST_TITLE
Seat_back_Dummy
*SET_SHELL_LIST_TITLE
Seat_back_Support
*SET_PART_LIST_TITLE
Seat_bottom_Dummy
*SET_PART_LIST_TITLE
Seat_bottom_Foam
*SET_SHELL_LIST_TITLE
Seat_Botoom_Support
*SET_PART_LIST_TITLE
Fullbody_Contact