*KEYWORD
*MAT_FU_CHANG_FOAM_TITLE
RG60
*MAT_PIECEWISE_LINEAR_PLASTICITY_TITLE
Seat_Cushion
*MAT_RIGID_TITLE
RIGID_MAT_FLOOR
*MAT_MODIFIED_PIECEWISE_LINEAR_PLASTICITY_TITLE
HDPE_FUEL_TANK
*MAT_RIGID_TITLE
TUNED_REAR_BREAKS_RIGID_MAT_STEEL
*MAT_ENHANCED_COMPOSITE_DAMAGE_TITLE
 MAT54-MAT55 MAT_ENHANCED_COMPOSITE_DAMAGE
*MAT_RIGID_TITLE
TUNED_RIGID_MAT_STEEL
*MAT_MODIFIED_PIECEWISE_LINEAR_PLASTICITY_TITLE
DP 800-1180
*MAT_MODIFIED_PIECEWISE_LINEAR_PLASTICITY_TITLE
TRIP 450-800
*MAT_MODIFIED_PIECEWISE_LINEAR_PLASTICITY_TITLE
Tuned_AA356 T6 - Cast Grade
*MAT_MODIFIED_PIECEWISE_LINEAR_PLASTICITY_TITLE
Novelis AA 5182
*MAT_MODIFIED_PIECEWISE_LINEAR_PLASTICITY_TITLE
Novelis AA 6451
*MAT_MODIFIED_PIECEWISE_LINEAR_PLASTICITY_TITLE
AA 6014 T7
*MAT_MODIFIED_PIECEWISE_LINEAR_PLASTICITY_TITLE
AA 6014 T4
*MAT_MODIFIED_PIECEWISE_LINEAR_PLASTICITY_TITLE
AA 6014 T6
*MAT_MODIFIED_PIECEWISE_LINEAR_PLASTICITY_TITLE
6111 T6
*MAT_MODIFIED_PIECEWISE_LINEAR_PLASTICITY_TITLE
UHS Fusion
*MAT_MODIFIED_PIECEWISE_LINEAR_PLASTICITY_TITLE
AL AC 300 T5
*MAT_MODIFIED_PIECEWISE_LINEAR_PLASTICITY_TITLE
AL 6111 T4
*MAT_MODIFIED_PIECEWISE_LINEAR_PLASTICITY_TITLE
AL 5754
*MAT_SPRING_NONLINEAR_ELASTIC_TITLE
60 K MAT200 MAT_SPRING_ELASTIC_exhaust
*MAT_PIECEWISE_LINEAR_PLASTICITY_TITLE
BH 260/370
*MAT_NULL_TITLE
NULL_MAT
*MAT_PIECEWISE_LINEAR_PLASTICITY_TITLE
Glass
*MAT_VISCOELASTIC_TITLE
Bushing MAT6 MAT_VISCOELASTIC
*MAT_PIECEWISE_LINEAR_PLASTICITY_TITLE
Fascia Plastic MAT24
*MAT_MODIFIED_PIECEWISE_LINEAR_PLASTICITY_TITLE
MS 1250-1500
*MAT_ELASTIC_TITLE
NEW_TYRE_RUBBER_MATERIAL
*MAT_PIECEWISE_LINEAR_PLASTICITY_TITLE
BH 210-340
*MAT_PIECEWISE_LINEAR_PLASTICITY_TITLE
BH 280-400
*MAT_PIECEWISE_LINEAR_PLASTICITY_TITLE
Mild 140-270
*MAT_MODIFIED_PIECEWISE_LINEAR_PLASTICITY_TITLE
DP 1150-1270
*MAT_PIECEWISE_LINEAR_PLASTICITY_TITLE
DP 700-1000
*MAT_MODIFIED_PIECEWISE_LINEAR_PLASTICITY_TITLE
HF 1050-1500
*MAT_PIECEWISE_LINEAR_PLASTICITY_TITLE
DP 500-800
*MAT_PIECEWISE_LINEAR_PLASTICITY_TITLE
HSLA 420-500
*MAT_SPOTWELD_TITLE
Default MAT_SPOTWELD Material
*MAT_SPOTWELD_TITLE
Default MAT_SPOTWELD Material
*MAT_MODIFIED_PIECEWISE_LINEAR_PLASTICITY_TITLE
Windows glass
*MAT_PIECEWISE_LINEAR_PLASTICITY_TITLE
Windshield Polymer
*MAT_PIECEWISE_LINEAR_PLASTICITY_TITLE
Fascia Plastic MAT24_FOR_FUEL_TANK
*MAT_PIECEWISE_LINEAR_PLASTICITY_TITLE
TUNED_FRONT_DIFFERENTIAL_ALLOY
*MAT_PIECEWISE_LINEAR_PLASTICITY_TITLE
TUNED_REAR_DIFFERENTIAL_ALLOY
*MAT_RIGID_TITLE
TUNED_TRANSFERCASE_ALLOY
*MAT_RIGID_TITLE
TUNED_REAR_DIFFERENTIAL_ALLOY
*MAT_RIGID_TITLE
TUNED_TRANSMISSION_ALLOY
*MAT_RIGID_TITLE
TUNED_ENGINE_ALLOY
*MAT_PIECEWISE_LINEAR_PLASTICITY_TITLE
TUNED_EXHAUST_MANIFOLD
*MAT_RIGID_TITLE
TUNED_BRAKE_COVER
*MAT_RIGID_TITLE
TUNED_REAR_DISC_BRAKES
*MAT_RIGID_TITLE
RIGID_MAT_ALUMINIUM
*MAT_PIECEWISE_LINEAR_PLASTICITY_TITLE
PLASTIC
*MAT_DAMPER_VISCOUS_TITLE
Default MAT201 MAT_DAMPER_VISCOUS
*MAT_PIECEWISE_LINEAR_PLASTICITY_TITLE
Suspension tuned MAT_ELASTIC
*MAT_SPRING_NONLINEAR_ELASTIC_TITLE
60 K MAT200 MAT_SPRING_ELASTIC
*MAT_PIECEWISE_LINEAR_PLASTICITY_TITLE
Powertrain tuned MAT_ELASTIC
*MAT_PIECEWISE_LINEAR_PLASTICITY_TITLE
HSLA 350-450
*MAT_PIECEWISE_LINEAR_PLASTICITY_TITLE
HSLA 550-650
*MAT_ELASTIC_TITLE
Adhesives_Dummy
*MAT_VISCOELASTIC_TITLE
MAT_VISCOELASTIC
*MAT_RIGID_TITLE
RIGID_TUNED_MAT_STEEL_BRAKE-DISC
*MAT_RIGID_TITLE
RIGID_TUNED_MAT_STEEL_STEERING-HUB
*MAT_RIGID_TITLE
RIGID_TUNED_MAT_Al_STEERING_KNUCKLE
*MAT_RIGID_TITLE
RIGID_MAT_STEEL
*MAT_DAMPER_NONLINEAR_VISCOUS_TITLE
MAT204 MAT_DAMPER_NONLINEAR_VISCOUS
*MAT_SPRING_NONLINEAR_ELASTIC_TITLE
MAT_SPRING_NONLINEAR_ELASTIC
*MAT_PIECEWISE_LINEAR_PLASTICITY_TITLE
COIL_SPRING
*MAT_RIGID_TITLE
RIGID_MAT
*MAT_PIECEWISE_LINEAR_PLASTICITY_TITLE
STEEL_700 MPa
*MAT_RIGID_TITLE
Accelerometer Material - High density 7.85 X 10
*MAT_PIECEWISE_LINEAR_PLASTICITY_TITLE
DP500-800_NR
*MAT_LINEAR_ELASTIC_DISCRETE_BEAM_TITLE
Beam_Stiffness_right
*MAT_LINEAR_ELASTIC_DISCRETE_BEAM_TITLE
Beam_Stiffness_left
*MAT_RIGID_TITLE
RIGID_STEEL.1
*MAT_SPOTWELD_TITLE
Default MAT100 MAT_SPOTWELD
*MAT_RIGID_TITLE
RIGID_STEEL.1.1
*MAT_RIGID_TITLE
Accelerometer Material - High density 7.85 X 10
*MAT_PIECEWISE_LINEAR_PLASTICITY_TITLE
STEEL_700 MPa
*MAT_RIGID_TITLE
RIGID_MAT
*MAT_PIECEWISE_LINEAR_PLASTICITY_TITLE
COIL_SPRING
*MAT_SPRING_NONLINEAR_ELASTIC_TITLE
MAT_SPRING_NONLINEAR_ELASTIC
*MAT_DAMPER_NONLINEAR_VISCOUS_TITLE
MAT204 MAT_DAMPER_NONLINEAR_VISCOUS
*MAT_RIGID_TITLE
RIGID_MAT_STEEL
*MAT_RIGID_TITLE
RIGID_TUNED_MAT_Al_STEERING_KNUCKLE
*MAT_RIGID_TITLE
RIGID_TUNED_MAT_STEEL_STEERING-HUB
*MAT_RIGID_TITLE
RIGID_TUNED_MAT_STEEL_BRAKE-DISC
*MAT_VISCOELASTIC_TITLE
MAT_VISCOELASTIC
*MAT_ELASTIC_TITLE
Adhesives_Dummy
*MAT_PIECEWISE_LINEAR_PLASTICITY_TITLE
HSLA 550-650
*MAT_PIECEWISE_LINEAR_PLASTICITY_TITLE
HSLA 350-450
*MAT_PIECEWISE_LINEAR_PLASTICITY_TITLE
Powertrain tuned MAT_ELASTIC
*MAT_SPRING_NONLINEAR_ELASTIC_TITLE
60 K MAT200 MAT_SPRING_ELASTIC
*MAT_PIECEWISE_LINEAR_PLASTICITY_TITLE
Suspension tuned MAT_ELASTIC
*MAT_DAMPER_VISCOUS_TITLE
Default MAT201 MAT_DAMPER_VISCOUS
*MAT_PIECEWISE_LINEAR_PLASTICITY_TITLE
PLASTIC
*MAT_RIGID_TITLE
RIGID_MAT_ALUMINIUM
*MAT_RIGID_TITLE
TUNED_REAR_DISC_BRAKES
*MAT_RIGID_TITLE
TUNED_BRAKE_COVER
*MAT_PIECEWISE_LINEAR_PLASTICITY_TITLE
TUNED_EXHAUST_MANIFOLD
*MAT_RIGID_TITLE
TUNED_ENGINE_ALLOY
*MAT_RIGID_TITLE
TUNED_TRANSMISSION_ALLOY
*MAT_RIGID_TITLE
TUNED_REAR_DIFFERENTIAL_ALLOY
*MAT_RIGID_TITLE
TUNED_TRANSFERCASE_ALLOY
*MAT_PIECEWISE_LINEAR_PLASTICITY_TITLE
TUNED_REAR_DIFFERENTIAL_ALLOY
*MAT_PIECEWISE_LINEAR_PLASTICITY_TITLE
TUNED_FRONT_DIFFERENTIAL_ALLOY
*MAT_PIECEWISE_LINEAR_PLASTICITY_TITLE
Fascia Plastic MAT24_FOR_FUEL_TANK
*MAT_PIECEWISE_LINEAR_PLASTICITY_TITLE
Windshield Polymer
*MAT_MODIFIED_PIECEWISE_LINEAR_PLASTICITY_TITLE
Windows glass
*MAT_SPOTWELD_TITLE
Default MAT_SPOTWELD Material
*MAT_SPOTWELD_TITLE
Default MAT_SPOTWELD Material
*MAT_PIECEWISE_LINEAR_PLASTICITY_TITLE
HSLA 420-500
*MAT_PIECEWISE_LINEAR_PLASTICITY_TITLE
DP 500-800
*MAT_MODIFIED_PIECEWISE_LINEAR_PLASTICITY_TITLE
HF 1050-1500
*MAT_PIECEWISE_LINEAR_PLASTICITY_TITLE
DP 700-1000
*MAT_MODIFIED_PIECEWISE_LINEAR_PLASTICITY_TITLE
DP 1150-1270
*MAT_PIECEWISE_LINEAR_PLASTICITY_TITLE
Mild 140-270
*MAT_PIECEWISE_LINEAR_PLASTICITY_TITLE
BH 280-400
*MAT_PIECEWISE_LINEAR_PLASTICITY_TITLE
BH 210-340
*MAT_ELASTIC_TITLE
NEW_TYRE_RUBBER_MATERIAL
*MAT_MODIFIED_PIECEWISE_LINEAR_PLASTICITY_TITLE
MS 1250-1500
*MAT_PIECEWISE_LINEAR_PLASTICITY_TITLE
Fascia Plastic MAT24
*MAT_VISCOELASTIC_TITLE
Bushing MAT6 MAT_VISCOELASTIC
*MAT_PIECEWISE_LINEAR_PLASTICITY_TITLE
Glass
*MAT_NULL_TITLE
NULL_MAT
*MAT_PIECEWISE_LINEAR_PLASTICITY_TITLE
BH 260/370
*MAT_SPRING_NONLINEAR_ELASTIC_TITLE
60 K MAT200 MAT_SPRING_ELASTIC_exhaust
*MAT_MODIFIED_PIECEWISE_LINEAR_PLASTICITY_TITLE
AL 5754
*MAT_MODIFIED_PIECEWISE_LINEAR_PLASTICITY_TITLE
AL 6111 T4
*MAT_MODIFIED_PIECEWISE_LINEAR_PLASTICITY_TITLE
AL AC 300 T5
*MAT_MODIFIED_PIECEWISE_LINEAR_PLASTICITY_TITLE
UHS Fusion
*MAT_MODIFIED_PIECEWISE_LINEAR_PLASTICITY_TITLE
6111 T6
*MAT_MODIFIED_PIECEWISE_LINEAR_PLASTICITY_TITLE
AA 6014 T6
*MAT_MODIFIED_PIECEWISE_LINEAR_PLASTICITY_TITLE
AA 6014 T4
*MAT_MODIFIED_PIECEWISE_LINEAR_PLASTICITY_TITLE
AA 6014 T7
*MAT_MODIFIED_PIECEWISE_LINEAR_PLASTICITY_TITLE
Novelis AA 6451
*MAT_MODIFIED_PIECEWISE_LINEAR_PLASTICITY_TITLE
Novelis AA 5182
*MAT_MODIFIED_PIECEWISE_LINEAR_PLASTICITY_TITLE
Tuned_AA356 T6 - Cast Grade
*MAT_MODIFIED_PIECEWISE_LINEAR_PLASTICITY_TITLE
TRIP 450-800
*MAT_MODIFIED_PIECEWISE_LINEAR_PLASTICITY_TITLE
DP 800-1180
*MAT_RIGID_TITLE
TUNED_RIGID_MAT_STEEL
*MAT_ENHANCED_COMPOSITE_DAMAGE_TITLE
 MAT54-MAT55 MAT_ENHANCED_COMPOSITE_DAMAGE
*MAT_RIGID_TITLE
TUNED_REAR_BREAKS_RIGID_MAT_STEEL
*MAT_MODIFIED_PIECEWISE_LINEAR_PLASTICITY_TITLE
HDPE_FUEL_TANK
*MAT_ELASTIC_TITLE
beam_material
*MAT_ELASTIC_TITLE
Default MAT1 Material
*MAT_FU_CHANG_FOAM_TITLE
RG60_Headrest
*DEFINE_TABLE_TITLE
HSLA 550-650
*DEFINE_CURVE_TITLE
HSLA550-650 0.004/s
*DEFINE_CURVE_TITLE
HSLA550-650 1/s
*DEFINE_CURVE_TITLE
HSLA550-650 10/s
*DEFINE_CURVE_TITLE
HSLA550-650 100/s
*DEFINE_CURVE_TITLE
HSLA550-650 250/s
*DEFINE_TABLE_TITLE
BH 280/400
*DEFINE_CURVE_TITLE
BH 280 .005/sec
*DEFINE_CURVE_TITLE
BH 280 1/sec
*DEFINE_CURVE_TITLE
BH 280 10/sec
*DEFINE_CURVE_TITLE
BH 280 100/sec
*DEFINE_CURVE_TITLE
BH 280 225/sec
*DEFINE_TABLE_TITLE
HSLA420/500
*DEFINE_CURVE_TITLE
HSLA 420/500 0/s
*DEFINE_CURVE_TITLE
HSLA 420/500 43.9/s
*DEFINE_CURVE_TITLE
HSLA 420/500 87.8/s
*DEFINE_CURVE_TITLE
HSLA 420/500 256.2/s
*DEFINE_CURVE_TITLE
HSLA420/500 526.609/s
*DEFINE_TABLE_TITLE
IF 140-270
*DEFINE_CURVE_TITLE
IF140-270 with SR 0.001/s
*DEFINE_CURVE_TITLE
IF140-270 with SR .1/sec
*DEFINE_CURVE_TITLE
IF140-270 with SR 50/sec
*DEFINE_CURVE_TITLE
IF140-270 with SR 100/sec
*DEFINE_CURVE_TITLE
IF140-270 with SR 6000/sec
*DEFINE_TABLE_TITLE
DP700-1000
*DEFINE_CURVE_TITLE
DP700-1000 with SR 0.001/s
*DEFINE_CURVE_TITLE
DP700-1000 with SR 0.1/s
*DEFINE_CURVE_TITLE
DP700-1000 with SR 1/s
*DEFINE_CURVE_TITLE
DP700-1000 with SR 10/s
*DEFINE_CURVE_TITLE
DP700-1000 with SR 100/s
*DEFINE_CURVE_TITLE
DP700-1000 with SR 1000/s
*DEFINE_TABLE_TITLE
HF 1050-1500
*DEFINE_CURVE_TITLE
HF 1050-1500 with SR 0.004/s
*DEFINE_CURVE_TITLE
HF 1050-1500 with SR 1/s
*DEFINE_CURVE_TITLE
HF 1050-1500 with SR 20/s
*DEFINE_CURVE_TITLE
HF 1050-1500 with SR 200/s
*DEFINE_TABLE_TITLE
HSLA 350/450
*DEFINE_CURVE_TITLE
HSLA350-450 with SR .005/sec
*DEFINE_CURVE_TITLE
HSLA350-450 with SR .1/sec
*DEFINE_CURVE_TITLE
HSLA350-450 with SR 10/sec
*DEFINE_CURVE_TITLE
HSLA350-450 with SR 100/sec
*DEFINE_CURVE_TITLE
HSLA350-450 with SR 500/sec
*DEFINE_CURVE_TITLE
HSLA350-450 with SR 1000/sec
*DEFINE_TABLE_TITLE
BH 210-340
*DEFINE_CURVE_TITLE
BH210-340 with SR 0.001/sec
*DEFINE_CURVE_TITLE
BH210-340 with SR 1/sec
*DEFINE_CURVE_TITLE
BH210-340 with SR 100/sec
*DEFINE_CURVE_TITLE
BH210-340 with SR 3000/sec
*DEFINE_TABLE_TITLE
BH 280/400
*DEFINE_CURVE_TITLE
BH 280 with SR .005/sec
*DEFINE_CURVE_TITLE
BH 280 with SR 1/sec
*DEFINE_CURVE_TITLE
BH 280 with SR 10/sec
*DEFINE_CURVE_TITLE
BH 280 with SR 100/sec
*DEFINE_CURVE_TITLE
BH 280 with SR 225/sec
*DEFINE_TABLE_TITLE
MS 1250/1500
*DEFINE_CURVE_TITLE
MS 1250/1500 SR=0.004/SEC
*DEFINE_CURVE_TITLE
MS 1250/1500 SR=0.1/SEC
*DEFINE_CURVE_TITLE
MS 1250/1500 SR=10/SEC
*DEFINE_CURVE_TITLE
MS 1250/1500 SR=100/SEC
*DEFINE_CURVE_TITLE
MS 1250/1500 SR=258/SEC
*DEFINE_TABLE_TITLE
BH 280/400
*DEFINE_CURVE_TITLE
BH 280 .005/sec
*DEFINE_CURVE_TITLE
BH 280 1/sec
*DEFINE_CURVE_TITLE
BH 280 10/sec
*DEFINE_CURVE_TITLE
BH 280 100/sec
*DEFINE_CURVE_TITLE
BH 280 225/sec
*DEFINE_TABLE_TITLE
AL 5754
*DEFINE_CURVE_TITLE
AL 5754  0.00001/s
*DEFINE_CURVE_TITLE
AL 5754  0.1/s
*DEFINE_CURVE_TITLE
AL 5754  1/s
*DEFINE_CURVE_TITLE
AL 5754  10/s
*DEFINE_CURVE_TITLE
AL 5754  100/s
*DEFINE_CURVE_TITLE
AL 5754  500/s
*DEFINE_TABLE_TITLE
AL 6111 T4
*DEFINE_CURVE_TITLE
AL 6111 T4  0.00001/s
*DEFINE_CURVE_TITLE
AL 6111 T4  0.1/s
*DEFINE_CURVE_TITLE
AL 6111 T4  1/s
*DEFINE_CURVE_TITLE
AL 6111 T4  10/s
*DEFINE_CURVE_TITLE
AL 6111 T4  100/s
*DEFINE_CURVE_TITLE
AL 6111 T4  500/s
*DEFINE_TABLE_TITLE
AC 300 T5
*DEFINE_CURVE_TITLE
AC 300 T5 0.00001/s
*DEFINE_CURVE_TITLE
AC 300 T5 0.1/s
*DEFINE_CURVE_TITLE
AC 300 T5 1/s
*DEFINE_CURVE_TITLE
AC 300 T5 10/s
*DEFINE_CURVE_TITLE
AC 300 T5 100/s
*DEFINE_CURVE_TITLE
AC 300 T5 500/s
*DEFINE_TABLE_TITLE
UHS Fusion
*DEFINE_CURVE_TITLE
UHS Fusion 0.00001/s
*DEFINE_CURVE_TITLE
UHS Fusion 0.1/s
*DEFINE_CURVE_TITLE
UHS Fusion 1/s
*DEFINE_CURVE_TITLE
UHS Fusion 10/s
*DEFINE_CURVE_TITLE
UHS Fusion 100/s
*DEFINE_CURVE_TITLE
UHS Fusion 500/s
*DEFINE_TABLE_TITLE
6111 T6
*DEFINE_CURVE_TITLE
6111 T6   0.00001/s
*DEFINE_CURVE_TITLE
6111 T6   0.1/s
*DEFINE_CURVE_TITLE
6111 T6   1/s
*DEFINE_CURVE_TITLE
6111 T6   10/s
*DEFINE_CURVE_TITLE
6111 T6   100/s
*DEFINE_CURVE_TITLE
6111 T6   500/s
*DEFINE_TABLE_TITLE
AA6014 T6
*DEFINE_CURVE_TITLE
AA 6014 T6 0.00001/s
*DEFINE_CURVE_TITLE
AA 6014 T6 0.1/s
*DEFINE_CURVE_TITLE
AA 6014 T6 1/s
*DEFINE_CURVE_TITLE
AA 6014 T6 10/s
*DEFINE_CURVE_TITLE
AA 6014 T6 100/s
*DEFINE_CURVE_TITLE
AA 6014 T6 500/s
*DEFINE_TABLE_TITLE
6082 T6
*DEFINE_CURVE_TITLE
6082 T6 500/s
*DEFINE_CURVE_TITLE
6082 T6 100/s
*DEFINE_CURVE_TITLE
6082 T6 10/s
*DEFINE_CURVE_TITLE
6082 T6 1/s
*DEFINE_CURVE_TITLE
6082 T6 0.1/s
*DEFINE_CURVE_TITLE
6082 T6 0.00001/s
*DEFINE_TABLE_TITLE
AA 6014 T4
*DEFINE_CURVE_TITLE
AA 6014 T4 0.00001/s
*DEFINE_CURVE_TITLE
AA 6014 T4 0.1/s
*DEFINE_CURVE_TITLE
AA 6014 T4  1/s
*DEFINE_CURVE_TITLE
AA 6014 T4  10/s
*DEFINE_CURVE_TITLE
AA 6014 T4  100/s
*DEFINE_CURVE_TITLE
AA 6014 T4  500/s
*DEFINE_TABLE_TITLE
AA 6014 T7
*DEFINE_CURVE_TITLE
AA 6014 T7 0.00001/s
*DEFINE_CURVE_TITLE
AA 6014 T7 0.1/s
*DEFINE_CURVE_TITLE
AA 6014 T7  1/s
*DEFINE_CURVE_TITLE
AA 6014 T7  10/s
*DEFINE_CURVE_TITLE
AA 6014 T7  100/s
*DEFINE_CURVE_TITLE
AA 6014 T7  500/s
*DEFINE_TABLE_TITLE
Novelis AA 6451
*DEFINE_CURVE_TITLE
Novelis AA 6451 0.00001/s
*DEFINE_CURVE_TITLE
Novelis AA 6451 0.1/s
*DEFINE_CURVE_TITLE
Novelis AA 6451 1/s
*DEFINE_CURVE_TITLE
Novelis AA 6451 10/s
*DEFINE_CURVE_TITLE
Novelis AA 6451 100/s
*DEFINE_CURVE_TITLE
Novelis AA 6451 500/s
*DEFINE_TABLE_TITLE
Novelis AA 5182
*DEFINE_CURVE_TITLE
Novelis AA 5182 0000.1/s
*DEFINE_CURVE_TITLE
Novelis AA 5182 0.1/s
*DEFINE_CURVE_TITLE
Novelis AA 5182 1/s
*DEFINE_CURVE_TITLE
Novelis AA 5182 10/s
*DEFINE_CURVE_TITLE
Novelis AA 5182 100/s
*DEFINE_CURVE_TITLE
Novelis AA 5182 500/s
*DEFINE_TABLE_TITLE
AA356 T6 - Cast Grade
*DEFINE_CURVE_TITLE
AA356 T6 - Cast Grade 0.00001/s
*DEFINE_CURVE_TITLE
AA356 T6 - Cast Grade 0.1/s
*DEFINE_CURVE_TITLE
AA356 T6 - Cast Grade 1/s
*DEFINE_CURVE_TITLE
AA356 T6 - Cast Grade 10/s
*DEFINE_CURVE_TITLE
AA356 T6 - Cast Grade 100/s
*DEFINE_CURVE_TITLE
AA356 T6 - Cast Grade 500/s
*DEFINE_TABLE_TITLE
Trip 450-800
*DEFINE_CURVE_TITLE
TRIP 450-800 0.005/s
*DEFINE_CURVE_TITLE
TRIP 450-800 0.1/s
*DEFINE_CURVE_TITLE
TRIP 450-800 10/s
*DEFINE_CURVE_TITLE
TRIP 450-800 100/s
*DEFINE_CURVE_TITLE
TRIP 450-800 500/s
*DEFINE_TABLE_TITLE
DP 800-1180
*DEFINE_CURVE_TITLE
DP 800-1180 0.001/S
*DEFINE_CURVE_TITLE
DP 800-1180 0.1/S
*DEFINE_CURVE_TITLE
DP 800-1180 1/S
*DEFINE_CURVE_TITLE
DP 800-1180 10/S
*DEFINE_CURVE_TITLE
DP 800-1180 100/S
*DEFINE_CURVE_TITLE
DP 800-1180 1000/S
*DEFINE_TABLE_TITLE
DP1150/1270
*DEFINE_CURVE_TITLE
DP1150-1270_0.001/s
*DEFINE_CURVE_TITLE
DP1150-1270_0.1/s
*DEFINE_CURVE_TITLE
DP1150-1270_1/s
*DEFINE_CURVE_TITLE
DP1150-1270_10/s
*DEFINE_CURVE_TITLE
DP1150-1270_100/s
*DEFINE_CURVE_TITLE
DP1150-1270_1000/s
*DEFINE_TABLE_TITLE
Fuel_Tank_HDPE
*DEFINE_CURVE_TITLE
Fuel Tank_HDPE_0.01/s
*DEFINE_CURVE_TITLE
Fuel Tank_HDPE_0.1/s
*DEFINE_CURVE_TITLE
Fuel Tank_HDPE_1/s
*DEFINE_CURVE_TITLE
Fuel Tank_HDPE_10/s
*DEFINE_CURVE_TITLE
Fuel Tank_HDPE_100/s
*DEFINE_TABLE_TITLE
DP500-800
*DEFINE_CURVE_TITLE
DP500-800_0.005/s
*DEFINE_CURVE_TITLE
DP500-800_0.1/s
*DEFINE_CURVE_TITLE
DP500-800_10/s
*DEFINE_CURVE_TITLE
DP500-800_100/s
*DEFINE_CURVE_TITLE
DP500-800_500/s
*DEFINE_TABLE_TITLE
RG60
*DEFINE_CURVE_TITLE
RG60_0x00mm/ms
*DEFINE_CURVE_TITLE
RG60_0x0535mm/ms
*DEFINE_CURVE_TITLE
RG60_0x135mm/ms
*DEFINE_TABLE_TITLE
DP500-800
*DEFINE_CURVE_TITLE
DP500-800_0.005/s
*DEFINE_CURVE_TITLE
DP500-800_0.1/s
*DEFINE_CURVE_TITLE
DP500-800_10/s
*DEFINE_CURVE_TITLE
DP500-800_100/s
*DEFINE_CURVE_TITLE
DP500-800_500/s
*DEFINE_TABLE_TITLE
Fuel_Tank_HDPE
*DEFINE_CURVE_TITLE
Fuel Tank_HDPE_0.01/s
*DEFINE_CURVE_TITLE
Fuel Tank_HDPE_0.1/s
*DEFINE_CURVE_TITLE
Fuel Tank_HDPE_1/s
*DEFINE_CURVE_TITLE
Fuel Tank_HDPE_10/s
*DEFINE_CURVE_TITLE
Fuel Tank_HDPE_100/s
*DEFINE_TABLE_TITLE
DP1150/1270
*DEFINE_CURVE_TITLE
DP1150-1270_0.001/s
*DEFINE_CURVE_TITLE
DP1150-1270_0.1/s
*DEFINE_CURVE_TITLE
DP1150-1270_1/s
*DEFINE_CURVE_TITLE
DP1150-1270_10/s
*DEFINE_CURVE_TITLE
DP1150-1270_100/s
*DEFINE_CURVE_TITLE
DP1150-1270_1000/s
*DEFINE_TABLE_TITLE
DP 800-1180
*DEFINE_CURVE_TITLE
DP 800-1180 0.001/S
*DEFINE_CURVE_TITLE
DP 800-1180 0.1/S
*DEFINE_CURVE_TITLE
DP 800-1180 1/S
*DEFINE_CURVE_TITLE
DP 800-1180 10/S
*DEFINE_CURVE_TITLE
DP 800-1180 100/S
*DEFINE_CURVE_TITLE
DP 800-1180 1000/S
*DEFINE_TABLE_TITLE
Trip 450-800
*DEFINE_CURVE_TITLE
TRIP 450-800 0.005/s
*DEFINE_CURVE_TITLE
TRIP 450-800 0.1/s
*DEFINE_CURVE_TITLE
TRIP 450-800 10/s
*DEFINE_CURVE_TITLE
TRIP 450-800 100/s
*DEFINE_CURVE_TITLE
TRIP 450-800 500/s
*DEFINE_TABLE_TITLE
AA356 T6 - Cast Grade
*DEFINE_CURVE_TITLE
AA356 T6 - Cast Grade 0.00001/s
*DEFINE_CURVE_TITLE
AA356 T6 - Cast Grade 0.1/s
*DEFINE_CURVE_TITLE
AA356 T6 - Cast Grade 1/s
*DEFINE_CURVE_TITLE
AA356 T6 - Cast Grade 10/s
*DEFINE_CURVE_TITLE
AA356 T6 - Cast Grade 100/s
*DEFINE_CURVE_TITLE
AA356 T6 - Cast Grade 500/s
*DEFINE_TABLE_TITLE
Novelis AA 5182
*DEFINE_CURVE_TITLE
Novelis AA 5182 0000.1/s
*DEFINE_CURVE_TITLE
Novelis AA 5182 0.1/s
*DEFINE_CURVE_TITLE
Novelis AA 5182 1/s
*DEFINE_CURVE_TITLE
Novelis AA 5182 10/s
*DEFINE_CURVE_TITLE
Novelis AA 5182 100/s
*DEFINE_CURVE_TITLE
Novelis AA 5182 500/s
*DEFINE_TABLE_TITLE
Novelis AA 6451
*DEFINE_CURVE_TITLE
Novelis AA 6451 0.00001/s
*DEFINE_CURVE_TITLE
Novelis AA 6451 0.1/s
*DEFINE_CURVE_TITLE
Novelis AA 6451 1/s
*DEFINE_CURVE_TITLE
Novelis AA 6451 10/s
*DEFINE_CURVE_TITLE
Novelis AA 6451 100/s
*DEFINE_CURVE_TITLE
Novelis AA 6451 500/s
*DEFINE_TABLE_TITLE
AA 6014 T7
*DEFINE_CURVE_TITLE
AA 6014 T7 0.00001/s
*DEFINE_CURVE_TITLE
AA 6014 T7 0.1/s
*DEFINE_CURVE_TITLE
AA 6014 T7  1/s
*DEFINE_CURVE_TITLE
AA 6014 T7  10/s
*DEFINE_CURVE_TITLE
AA 6014 T7  100/s
*DEFINE_CURVE_TITLE
AA 6014 T7  500/s
*DEFINE_TABLE_TITLE
AA 6014 T4
*DEFINE_CURVE_TITLE
AA 6014 T4 0.00001/s
*DEFINE_CURVE_TITLE
AA 6014 T4 0.1/s
*DEFINE_CURVE_TITLE
AA 6014 T4  1/s
*DEFINE_CURVE_TITLE
AA 6014 T4  10/s
*DEFINE_CURVE_TITLE
AA 6014 T4  100/s
*DEFINE_CURVE_TITLE
AA 6014 T4  500/s
*DEFINE_TABLE_TITLE
6082 T6
*DEFINE_CURVE_TITLE
6082 T6 500/s
*DEFINE_CURVE_TITLE
6082 T6 100/s
*DEFINE_CURVE_TITLE
6082 T6 10/s
*DEFINE_CURVE_TITLE
6082 T6 1/s
*DEFINE_CURVE_TITLE
6082 T6 0.1/s
*DEFINE_CURVE_TITLE
6082 T6 0.00001/s
*DEFINE_TABLE_TITLE
AA6014 T6
*DEFINE_CURVE_TITLE
AA 6014 T6 0.00001/s
*DEFINE_CURVE_TITLE
AA 6014 T6 0.1/s
*DEFINE_CURVE_TITLE
AA 6014 T6 1/s
*DEFINE_CURVE_TITLE
AA 6014 T6 10/s
*DEFINE_CURVE_TITLE
AA 6014 T6 100/s
*DEFINE_CURVE_TITLE
AA 6014 T6 500/s
*DEFINE_TABLE_TITLE
6111 T6
*DEFINE_CURVE_TITLE
6111 T6   0.00001/s
*DEFINE_CURVE_TITLE
6111 T6   0.1/s
*DEFINE_CURVE_TITLE
6111 T6   1/s
*DEFINE_CURVE_TITLE
6111 T6   10/s
*DEFINE_CURVE_TITLE
6111 T6   100/s
*DEFINE_CURVE_TITLE
6111 T6   500/s
*DEFINE_TABLE_TITLE
UHS Fusion
*DEFINE_CURVE_TITLE
UHS Fusion 0.00001/s
*DEFINE_CURVE_TITLE
UHS Fusion 0.1/s
*DEFINE_CURVE_TITLE
UHS Fusion 1/s
*DEFINE_CURVE_TITLE
UHS Fusion 10/s
*DEFINE_CURVE_TITLE
UHS Fusion 100/s
*DEFINE_CURVE_TITLE
UHS Fusion 500/s
*DEFINE_TABLE_TITLE
AC 300 T5
*DEFINE_CURVE_TITLE
AC 300 T5 0.00001/s
*DEFINE_CURVE_TITLE
AC 300 T5 0.1/s
*DEFINE_CURVE_TITLE
AC 300 T5 1/s
*DEFINE_CURVE_TITLE
AC 300 T5 10/s
*DEFINE_CURVE_TITLE
AC 300 T5 100/s
*DEFINE_CURVE_TITLE
AC 300 T5 500/s
*DEFINE_TABLE_TITLE
AL 6111 T4
*DEFINE_CURVE_TITLE
AL 6111 T4  0.00001/s
*DEFINE_CURVE_TITLE
AL 6111 T4  0.1/s
*DEFINE_CURVE_TITLE
AL 6111 T4  1/s
*DEFINE_CURVE_TITLE
AL 6111 T4  10/s
*DEFINE_CURVE_TITLE
AL 6111 T4  100/s
*DEFINE_CURVE_TITLE
AL 6111 T4  500/s
*DEFINE_TABLE_TITLE
AL 5754
*DEFINE_CURVE_TITLE
AL 5754  0.00001/s
*DEFINE_CURVE_TITLE
AL 5754  0.1/s
*DEFINE_CURVE_TITLE
AL 5754  1/s
*DEFINE_CURVE_TITLE
AL 5754  10/s
*DEFINE_CURVE_TITLE
AL 5754  100/s
*DEFINE_CURVE_TITLE
AL 5754  500/s
*DEFINE_TABLE_TITLE
BH 280/400
*DEFINE_CURVE_TITLE
BH 280 .005/sec
*DEFINE_CURVE_TITLE
BH 280 1/sec
*DEFINE_CURVE_TITLE
BH 280 10/sec
*DEFINE_CURVE_TITLE
BH 280 100/sec
*DEFINE_CURVE_TITLE
BH 280 225/sec
*DEFINE_TABLE_TITLE
MS 1250/1500
*DEFINE_CURVE_TITLE
MS 1250/1500 SR=0.004/SEC
*DEFINE_CURVE_TITLE
MS 1250/1500 SR=0.1/SEC
*DEFINE_CURVE_TITLE
MS 1250/1500 SR=10/SEC
*DEFINE_CURVE_TITLE
MS 1250/1500 SR=100/SEC
*DEFINE_CURVE_TITLE
MS 1250/1500 SR=258/SEC
*DEFINE_TABLE_TITLE
BH 280/400
*DEFINE_CURVE_TITLE
BH 280 with SR .005/sec
*DEFINE_CURVE_TITLE
BH 280 with SR 1/sec
*DEFINE_CURVE_TITLE
BH 280 with SR 10/sec
*DEFINE_CURVE_TITLE
BH 280 with SR 100/sec
*DEFINE_CURVE_TITLE
BH 280 with SR 225/sec
*DEFINE_TABLE_TITLE
BH 210-340
*DEFINE_CURVE_TITLE
BH210-340 with SR 0.001/sec
*DEFINE_CURVE_TITLE
BH210-340 with SR 1/sec
*DEFINE_CURVE_TITLE
BH210-340 with SR 100/sec
*DEFINE_CURVE_TITLE
BH210-340 with SR 3000/sec
*DEFINE_TABLE_TITLE
HSLA 350/450
*DEFINE_CURVE_TITLE
HSLA350-450 with SR .005/sec
*DEFINE_CURVE_TITLE
HSLA350-450 with SR .1/sec
*DEFINE_CURVE_TITLE
HSLA350-450 with SR 10/sec
*DEFINE_CURVE_TITLE
HSLA350-450 with SR 100/sec
*DEFINE_CURVE_TITLE
HSLA350-450 with SR 500/sec
*DEFINE_CURVE_TITLE
HSLA350-450 with SR 1000/sec
*DEFINE_TABLE_TITLE
HF 1050-1500
*DEFINE_CURVE_TITLE
HF 1050-1500 with SR 0.004/s
*DEFINE_CURVE_TITLE
HF 1050-1500 with SR 1/s
*DEFINE_CURVE_TITLE
HF 1050-1500 with SR 20/s
*DEFINE_CURVE_TITLE
HF 1050-1500 with SR 200/s
*DEFINE_TABLE_TITLE
DP700-1000
*DEFINE_CURVE_TITLE
DP700-1000 with SR 0.001/s
*DEFINE_CURVE_TITLE
DP700-1000 with SR 0.1/s
*DEFINE_CURVE_TITLE
DP700-1000 with SR 1/s
*DEFINE_CURVE_TITLE
DP700-1000 with SR 10/s
*DEFINE_CURVE_TITLE
DP700-1000 with SR 100/s
*DEFINE_CURVE_TITLE
DP700-1000 with SR 1000/s
*DEFINE_TABLE_TITLE
IF 140-270
*DEFINE_CURVE_TITLE
IF140-270 with SR 0.001/s
*DEFINE_CURVE_TITLE
IF140-270 with SR .1/sec
*DEFINE_CURVE_TITLE
IF140-270 with SR 50/sec
*DEFINE_CURVE_TITLE
IF140-270 with SR 100/sec
*DEFINE_CURVE_TITLE
IF140-270 with SR 6000/sec
*DEFINE_TABLE_TITLE
HSLA420/500
*DEFINE_CURVE_TITLE
HSLA 420/500 0/s
*DEFINE_CURVE_TITLE
HSLA 420/500 43.9/s
*DEFINE_CURVE_TITLE
HSLA 420/500 87.8/s
*DEFINE_CURVE_TITLE
HSLA 420/500 256.2/s
*DEFINE_CURVE_TITLE
HSLA420/500 526.609/s
*DEFINE_TABLE_TITLE
BH 280/400
*DEFINE_CURVE_TITLE
BH 280 .005/sec
*DEFINE_CURVE_TITLE
BH 280 1/sec
*DEFINE_CURVE_TITLE
BH 280 10/sec
*DEFINE_CURVE_TITLE
BH 280 100/sec
*DEFINE_CURVE_TITLE
BH 280 225/sec
*DEFINE_TABLE_TITLE
HSLA 550-650
*DEFINE_CURVE_TITLE
HSLA550-650 0.004/s
*DEFINE_CURVE_TITLE
HSLA550-650 1/s
*DEFINE_CURVE_TITLE
HSLA550-650 10/s
*DEFINE_CURVE_TITLE
HSLA550-650 100/s
*DEFINE_CURVE_TITLE
HSLA550-650 250/s
*DEFINE_TABLE_TITLE
DP500-800
*DEFINE_CURVE_TITLE
DP500-800_0.005/s
*DEFINE_CURVE_TITLE
DP500-800_0.1/s
*DEFINE_CURVE_TITLE
DP500-800_10/s
*DEFINE_CURVE_TITLE
DP500-800_100/s
*DEFINE_CURVE_TITLE
DP500-800_500/s
*DEFINE_CURVE_TITLE
Anonymous *DEFINE_CURVE
*DEFINE_CURVE_TITLE
DEFINE_CURVE_2000300
*DEFINE_CURVE_TITLE
DEFINE_CURVE_2000426
*DEFINE_CURVE_TITLE
DEFINE_CURVE_2000425
*DEFINE_CURVE_TITLE
BH210-340 with SR 0.001/sec
*DEFINE_CURVE_TITLE
BH210-340 with SR 1/sec
*DEFINE_CURVE_TITLE
BH210-340 with SR 100/sec
*DEFINE_CURVE_TITLE
BH210-340 with SR 3000/sec
*DEFINE_CURVE_TITLE
HSLA 420/500 87.8/s
*DEFINE_CURVE_TITLE
HSLA 420/500 256.2/s
*DEFINE_CURVE_TITLE
HSLA420/500 526.609/s
*DEFINE_CURVE_TITLE
Exhaust_spring
*DEFINE_CURVE_TITLE
Exhaust_spring
*DEFINE_CURVE_TITLE
HSLA420/500 526.609/s
*DEFINE_CURVE_TITLE
HSLA 420/500 256.2/s
*DEFINE_CURVE_TITLE
HSLA 420/500 87.8/s
*DEFINE_CURVE_TITLE
BH210-340 with SR 3000/sec
*DEFINE_CURVE_TITLE
BH210-340 with SR 100/sec
*DEFINE_CURVE_TITLE
BH210-340 with SR 1/sec
*DEFINE_CURVE_TITLE
BH210-340 with SR 0.001/sec
*DEFINE_CURVE_TITLE
DEFINE_CURVE_2000425
*DEFINE_CURVE_TITLE
DEFINE_CURVE_2000426
*DEFINE_CURVE_TITLE
DEFINE_CURVE_2000300
*DEFINE_CURVE_TITLE
Anonymous *DEFINE_CURVE