*KEYWORD
*NODE
*CONSTRAINED_NODAL_RIGID_BODY
*ELEMENT_SHELL
*ELEMENT_SOLID
*PART
Base_Cushion_Skin
*SECTION_SHELL_TITLE
Base_Cushion_Skin
*PART
Base_Cushion_Solid
*SECTION_SOLID_TITLE
Base_Cushion_Solid
*PART
SECTION_SHELL
*SECTION_SHELL_TITLE
SECTION_SHELL
*PART
Back_Cushion_Skin
*SECTION_SHELL_TITLE
Back_Cushion_Skin
*PART
HEAD_REST
*SECTION_SHELL_TITLE
HEAD_REST
*PART
Default PSHELL Property_Volume_7
*SECTION_SOLID_TITLE
Default PSHELL Property_Volume_7
*PART
Back_Cushion_Skin
*SECTION_SOLID_TITLE
Back_Cushion_Skin
*MAT_ELASTIC_TITLE
Default MAT1 MAT_ELASTIC
*SET_NODE_LIST_TITLE
Seat_Base_Constraint
*SET_NODE_LIST_TITLE
Back_cushion_Contact
*SET_NODE_LIST_TITLE
Base_Cushion_Contact
*SET_NODE_LIST_TITLE
Head_Rest_Rod_Upper
*SET_NODE_LIST
*SET_NODE_LIST
*SET_NODE_LIST
*SET_NODE_LIST
*SET_NODE_LIST
*SET_NODE_LIST
*SET_SHELL_LIST_TITLE
SeatBottom_Support
*SET_PART_LIST_TITLE
Seat_BottomFoam
*SET_PART_LIST_TITLE
Dummy_SeatBottom
*SET_PART_LIST_TITLE
Dummy_SeatBack
*SET_SHELL_LIST_TITLE
SeatBack_Support
*SET_PART_LIST_TITLE
Seat_BackFoam