*KEYWORD
*NODE
*CONSTRAINED_JOINT_REVOLUTE_ID
*ELEMENT_SEATBELT
*ELEMENT_SHELL
*ELEMENT_SEATBELT_SLIPRING
*CONSTRAINED_EXTRA_NODES_NODE
*CONSTRAINED_EXTRA_NODES_SET
*PART
rigid3
*SECTION_SHELL_TITLE
rigid3
*PART
rigid2
*SECTION_SHELL_TITLE
rigid2
*PART
rigid1
*SECTION_SHELL_TITLE
rigid1
*PART
Diag Block  Puller
*SECTION_SHELL_TITLE
Diag Block  Puller
*PART
Chain
*SECTION_SEATBELT_TITLE
Chain
*PART
floor
*SECTION_SHELL_TITLE
floor
*LOAD_RIGID_BODY
*DEFINE_COORDINATE_SYSTEM_TITLE
Anonymous *DEFINE_COORDINATE_SYSTEM
*DEFINE_VECTOR_TITLE
Anonymous *DEFINE_COORDINATE_SYSTEM
*MAT_RIGID_TITLE
Default MAT20 MAT_RIGID no constraints
*MAT_RIGID_TITLE
Default MAT20 MAT_RIGID
*MAT_RIGID_TITLE
Rigid Steel Constrained
*MAT_SEATBELT_TITLE
Chain (1% elongation)
*MAT_RIGID_TITLE
Default MAT20 MAT_RIGID no constraints
*MAT_RIGID_TITLE
RIGID_MAT_FLOOR
*DEFINE_CURVE_TITLE
Cylinder_Load_Curve
*DEFINE_CURVE_TITLE
DEFINE_CURVE_118101
*DEFINE_CURVE_TITLE
cylinder_dis_curve
*SET_NODE_LIST_TITLE
SET_NODES_0019999999
*SET_NODE_LIST_TITLE
SET_NODES_0020000000
*END