*KEYWORD
*NODE
*CONSTRAINED_JOINT_REVOLUTE_ID
*CONSTRAINED_JOINT_REVOLUTE_ID
*CONSTRAINED_NODAL_RIGID_BODY
*ELEMENT_BEAM
*ELEMENT_BEAM_ORIENTATION
*ELEMENT_SEATBELT
*ELEMENT_SHELL
*ELEMENT_SHELL_BETA
*ELEMENT_SEATBELT_SLIPRING
*CONSTRAINED_EXTRA_NODES_NODE
*CONSTRAINED_EXTRA_NODES_SET
*CONTACT_AUTOMATIC_SURFACE_TO_SURFACE_ID
9999998   *CONTACT_AUTOMATIC_SURFACE_TO_SURFACE
*CONTACT_AUTOMATIC_SURFACE_TO_SURFACE_ID
9999999   *CONTACT_AUTOMATIC_SURFACE_TO_SURFACE
*CONTACT_AUTOMATIC_SURFACE_TO_SURFACE_ID
10000000  CG_BAR_TO_SEAT
*CONTACT_AUTOMATIC_SURFACE_TO_SURFACE_ID
10000001  LAP_Belt
*CONTACT_AUTOMATIC_SURFACE_TO_SURFACE_ID
10000002  Shoulder_belt
*PART
LAPBELT_SECTION_SHELL
*SECTION_SHELL_TITLE
LAPBELT_SECTION_SHELL
*PART
Seat_Buckle
*SECTION_SHELL_TITLE
Seat_Buckle
*PART
floor
*SECTION_SHELL_TITLE
floor
*PART
Lap_Block_Pull_RIGID
*SECTION_SHELL_TITLE
Lap_Block_Pull_RIGID
*PART
Seatbelt SECTION_SHELL
*SECTION_SHELL_TITLE
Seatbelt SECTION_SHELL
*PART
TRACTION_DEVICE_SHOULDER
*SECTION_SHELL_TITLE
TRACTION_DEVICE_SHOULDER
*PART
TRACTION_DEVICE_SHOULDER
*SECTION_SHELL_TITLE
TRACTION_DEVICE_SHOULDER
*PART_CONTACT
TRACTION_DEVICE_LAP
*SECTION_SHELL_TITLE
TRACTION_DEVICE_LAP
*PART
CG_Bar
*SECTION_SHELL_TITLE
CG_Bar
*PART
Torso_BlockPull_RIGID
*SECTION_SHELL_TITLE
Torso_BlockPull_RIGID
*PART
Seatbelt SECTION_SEATBELT
*SECTION_SEATBELT_TITLE
Seatbelt SECTION_SEATBELT
*PART
CG BAR LOAD
*SECTION_SHELL_TITLE
CG BAR LOAD
*PART
SECTION_BEAM
*SECTION_BEAM_TITLE
SECTION_BEAM
*LOAD_RIGID_BODY
*DEFINE_COORDINATE_SYSTEM_TITLE
Load_Direction
*DEFINE_VECTOR_TITLE
Load_Direction
*MAT_RIGID_TITLE
CG_Bar_MAT_Front
*MAT_RIGID_TITLE
Default MAT20 MAT_RIGID
*MAT_FABRIC_TITLE
Seatbelt_MAT
*MAT_RIGID_TITLE
RIGID_MAT_FLOOR
*MAT_RIGID_TITLE
CG_Bar_MAT
*MAT_SEATBELT_TITLE
Default MAT_SEATBELT Material
*MAT_RIGID_TITLE
MAT_RIGID_STEEL_BRACKET
*MAT_RIGID_TITLE
MAT_RIGID STEEL_BC_XYZ
*MAT_RIGID_TITLE
MAT_RIGID_STEEL_BLOCK_DIR
*MAT_ELASTIC_TITLE
Default MAT1 Material
*DEFINE_CURVE_TITLE
Belt_2
*DEFINE_CURVE_TITLE
Belt_1
*DEFINE_CURVE_TITLE
CG_Load_Curve
*DEFINE_CURVE_TITLE
Lap_Load_Curve
*DEFINE_CURVE_TITLE
Torso_Load_Curve
*DEFINE_CURVE_TITLE
Seatbelt_1D_Curve
*DEFINE_CURVE_TITLE
CG_Disp_Curve
*DEFINE_CURVE_TITLE
Lap_Disp_Curve
*DEFINE_CURVE_TITLE
Torso_Disp_Curve
*SET_PART_LIST_TITLE
SET_PROPERTIES_0009999997
*SET_PART_LIST_TITLE
CG_BAR
*SET_NODE_LIST
*SET_NODE_LIST
*SET_NODE_LIST_TITLE
RETRACTOR_NODAL_RIGID_BODY
*SET_NODE_LIST_TITLE
NODAL_RIGID_BODY_BELT@2
*SET_NODE_LIST_TITLE
NODAL_RIGID_BODY_BELT@1
*SET_NODE_LIST_TITLE
NODAL_RIGID_BODY_BELT@0
*SET_PART_LIST_TITLE
Torso_Pelvis_Set
*SET_PART_LIST_TITLE
Torso_Block
*SET_NODE_LIST_TITLE
CONSTRAINED_NODAL_RIGID_BODY_11_SET
*SET_NODE_LIST_TITLE
CONSTRAINED_NODAL_RIGID_BODY_13_SET
*SET_NODE_LIST_TITLE
Floor_contact
*SET_PART_LIST_TITLE
3-Point Seatbelt Entity Master Set@_1
*SET_NODE_LIST_TITLE
SET_NODES_0010000000
*SET_NODE_LIST_TITLE
SET_4000002
*SET_NODE_LIST_TITLE
SET_4000003
*SET_PART_LIST_TITLE
Pelvis_Block
*SET_NODE_LIST_TITLE
Anchor_points
*SET_PART_LIST_TITLE
Seat_Buckle
*SET_NODE_LIST
*SET_NODE_LIST_TITLE
CG_Weld
*SET_PART_LIST_TITLE
Default Seatbelt Entity Slave Set
*END